Exit status 1

Exit status 1 compilation error: exit status 1. Ld returned 1 exit status. ошибка компиляции для платы. репл. Exe : ошибка: ld.
Exit status 1 compilation error: exit status 1. Ld returned 1 exit status. ошибка компиляции для платы. репл. Exe : ошибка: ld.
загрузка npm. Exit status 1. Repl it. Esp8266 firmware tool command line. Exit status 1 ошибка компиляции.
загрузка npm. Exit status 1. Repl it. Esp8266 firmware tool command line. Exit status 1 ошибка компиляции.
Exit status 1. Exit status 1 compilation error: exit status 1. Exit status 1 ошибка компиляции для платы arduino uno. ошибка компиляции для платы arduino nano. Exit status 1.
Exit status 1. Exit status 1 compilation error: exit status 1. Exit status 1 ошибка компиляции для платы arduino uno. ошибка компиляции для платы arduino nano. Exit status 1.
Exit status 1 ошибка компиляции. Exit status 1. Exit c++. ошибка компиляции для платы arduino uno. ошибка exit status 1 в ардуино.
Exit status 1 ошибка компиляции. Exit status 1. Exit c++. ошибка компиляции для платы arduino uno. ошибка exit status 1 в ардуино.
Npm install –g @angular/cli. Exit status 1 ошибка компиляции для платы arduino due (programming port). Collect2: error: ld returned 1 exit status. ошибка компиляции для платы arduino uno. Exit status 1.
Npm install –g @angular/cli. Exit status 1 ошибка компиляции для платы arduino due (programming port). Collect2: error: ld returned 1 exit status. ошибка компиляции для платы arduino uno. Exit status 1.
Exit status 1. ошибка компиляции для платы arduino nano. ошибка ардуино exit status 1 жалоба на скобку. Expected ';' before '}' token. Exit status 1.
Exit status 1. ошибка компиляции для платы arduino nano. ошибка ардуино exit status 1 жалоба на скобку. Expected ';' before '}' token. Exit status 1.
Exit status 1. Afmotor библиотека ардуино. ошибка exit status 1 в ардуино. Id returned 1 exit status c++ ошибка. Exit status.
Exit status 1. Afmotor библиотека ардуино. ошибка exit status 1 в ардуино. Id returned 1 exit status c++ ошибка. Exit status.
Exit status 1c++. ошибка компиляции для платы ардуино. Linux x86_64. C++ error. Aes 128 ctr.
Exit status 1c++. ошибка компиляции для платы ардуино. Linux x86_64. C++ error. Aes 128 ctr.
Exit status 1. Exit status 1. Expected commajson(514). ошибка компиляции для платы arduino nano. ошибка на компе.
Exit status 1. Exit status 1. Expected commajson(514). ошибка компиляции для платы arduino nano. ошибка на компе.
Ccache git gentoo. Exit status 1. Error: expected signature for attiny13a is 1e 90 07 double check chip or use -f to override this check. Exit status 1. Exit status 1.
Ccache git gentoo. Exit status 1. Error: expected signature for attiny13a is 1e 90 07 double check chip or use -f to override this check. Exit status 1. Exit status 1.
Status error. Exit status 1c++. ошибка компиляции для платы arduino uno. Expected unqualified id before \x6e73 ошибка ардуин. ошибка компиляции для платы ардуино.
Status error. Exit status 1c++. ошибка компиляции для платы arduino uno. Expected unqualified id before \x6e73 ошибка ардуин. ошибка компиляции для платы ардуино.
Exit status 1 compilation error: exit status 1. Python css. ошибки в питоне. \com3". Expected unqualified-id.
Exit status 1 compilation error: exit status 1. Python css. ошибки в питоне. \com3". Expected unqualified-id.
Upload error: failed uploading: no upload port provided arduino windows. Exit status. Exit status 1 ошибка компиляции. ошибка компиляции для платы arduino nano. Exit status 1.
Upload error: failed uploading: no upload port provided arduino windows. Exit status. Exit status 1 ошибка компиляции. ошибка компиляции для платы arduino nano. Exit status 1.
Exit status 1. Collect2. Linux x86_64 где используется. Exit status 1. Exit status 1.
Exit status 1. Collect2. Linux x86_64 где используется. Exit status 1. Exit status 1.
Exit status. Id returned 1 exit status c++. Avrdude: ser_open(): can't set com-state for "\\. ошибка компиляции для платы arduino nano. Exit status 1 ошибка компиляции.
Exit status. Id returned 1 exit status c++. Avrdude: ser_open(): can't set com-state for "\\. ошибка компиляции для платы arduino nano. Exit status 1 ошибка компиляции.
как исправить. Exit status 1. Gnu gcc 3. Collect2: error: ld returned 1 exit status. Exit status 1.
как исправить. Exit status 1. Gnu gcc 3. Collect2: error: ld returned 1 exit status. Exit status 1.
Id returned 1 exit status c++ ошибка. компиляция arduino. Sha256 python encode. Exit status 1 compilation error: exit status 1. Exit status 1 ошибка компиляции.
Id returned 1 exit status c++ ошибка. компиляция arduino. Sha256 python encode. Exit status 1 compilation error: exit status 1. Exit status 1 ошибка компиляции.
Exit status 1. Replit code. Exit в питоне. Exit status. ошибка компиляции для платы nodemcu 1.
Exit status 1. Replit code. Exit в питоне. Exit status. ошибка компиляции для платы nodemcu 1.
команды по установке pytest. Hmac sha256. ошибка ардуино exit status 1 жалоба на скобку. Exit code: 128. ошибка an error occurred.
команды по установке pytest. Hmac sha256. ошибка ардуино exit status 1 жалоба на скобку. Exit code: 128. ошибка an error occurred.
Exit status 1
Exit status 1